Timeline track
type: Class
subclass of: Restriction
  on property: hasIdentifier
  all values from: Identifier
subclass of: Restriction
  on property: hasTimelineTrackPart
  all values from: EditorialObject
subclass of: Restriction
  on property: hasDuration
  max qualified cardinality: 1
  on class: TimelinePoint
subclass of: Restriction
  on property: hasObjectType
  max qualified cardinality: 1
  on class: Concept
subclass of: Restriction
  on property: description
  all values from: Literal
subclass of: Restriction
  on property: name
  all values from: Literal
description: To define a timed sequence of EditorialObjects.