Publication Event
type: Class
subclass of: Restriction
  on property: hasAccessConditions
  all values from: AccessConditions
subclass of: Restriction
  on property: hasAlternativeTitle
  all values from: AlternativeTitle
subclass of: Restriction
  on property: hasConsumptionCount
  all values from: ConsumptionCount
subclass of: Restriction
  on property: hasCoverageRestrictions
  all values from: CoverageRestrictions
subclass of: Restriction
  on property: hasIdentifier
  all values from: Identifier
subclass of: Restriction
  on property: hasObjectType
  all values from: Concept
subclass of: Restriction
  on property: hasPublicationChannel
  all values from: PublicationChannel
subclass of: Restriction
  on property: hasPublicationEvent
  all values from: Publication Event
subclass of: Restriction
  on property: hasPublicationMedium
  all values from: PublicationMedium
subclass of: Restriction
  on property: hasPublicationRegion
  all values from: Location
subclass of: Restriction
  on property: hasRestrictedAudience
  all values from: Audience
subclass of: Restriction
  on property: hasRights
  all values from: Rights
subclass of: Restriction
  on property: hasTargetAudience
  all values from: Audience
subclass of: Restriction
  on property: hasUsageRestrictions
  all values from: UsageRestrictions
subclass of: Restriction
  on property: isOfferedBy
  all values from: PublicationService
subclass of: Restriction
  on property: playsOut
  all values from: Essence
subclass of: Restriction
  on property: publishes
  all values from: EditorialObject
subclass of: Restriction
  on property: hasStartDateTime
  qualified cardinality: 1
  on class: Instant
subclass of: Restriction
  on property: hasDuration
  max qualified cardinality: 1
  on class: TimelinePoint
subclass of: Restriction
  on property: hasEndDateTime
  max qualified cardinality: 1
  on class: DateTimeDescription
subclass of: Restriction
  on property: hasScheduleDate
  max qualified cardinality: 1
  on class: Instant
subclass of: Restriction
  on property: title
  some values from: Literal
subclass of: Restriction
  on property: abstract
  all values from: Literal
subclass of: Restriction
  on property: description
  all values from: Literal
subclass of: Restriction
  on property: name
  all values from: Literal
subclass of: Restriction
  on property: firstShowing
  max qualified cardinality: 1
  on data range: boolean
subclass of: Restriction
  on property: firstShowingThisService
  max qualified cardinality: 1
  on data range: boolean
subclass of: Restriction
  on property: free
  max qualified cardinality: 1
  on data range: boolean
subclass of: Restriction
  on property: live
  max qualified cardinality: 1
  on data range: boolean
disjoint with: Rating
description: To describe any manifestation of an EditorialObject and associated Essence on any media (live, on demand, catch-up TV, etc.). A PublicationEvent can be e.g. a scheduled event, a broadcast event (originally not scheduled like "latest news"), or non-linear on-demand events and live-streaming.
definition: the event of publishing an Essence by a service to a channel under rights conditions
example: - the broadcasting of the football world cup final 2022 in a live video service over satellite by the BBC in Great Britain - the posting of Elon Musk's text "Next I'm buying Coca Cola to put the cocaine back in" on twitter, April 27, 2022, in his channel @elonmusk