Involvement
type: Class
subclass of: Restriction
  on property: bringsRights
  all values from: Rights
subclass of: Restriction
  on property: hasAgent
  all values from: Agent
subclass of: Restriction
  on property: hasAgentOnStagePosition
  all values from: OnStagePosition
subclass of: Restriction
  on property: hasAssociatedArtefact
  all values from: Artefact
subclass of: Restriction
  on property: hasIdentifier
  all values from: Identifier
subclass of: Restriction
  on property: hasObjectType
  all values from: Concept
subclass of: Restriction
  on property: hasRelatedArtefact
  all values from: Artefact
subclass of: Restriction
  on property: playsCharacter
  all values from: Character
subclass of: Restriction
  on property: usesProductionDevice
  all values from: ProductionDevice
subclass of: Restriction
  on property: description
  all values from: Literal
subclass of: Restriction
  on property: name
  all values from: Literal
description: To define Role played by an Agent. A «Role» will be identified e.g. by a Concept from a SKOS Classification Scheme.
definition: an Agent's participation in the creation or publication of a MediaResource
example: - authoring a screenplay for a film production - directing a movie - sound engineering of a talk show - creation special effects for a movie