Format
type: Class
subclass of: Concept
subclass of: Restriction
  on property: hasFormatId
  max qualified cardinality: 1
  on class: Identifier
subclass of: Restriction
  on property: hasFormatVersionId
  max qualified cardinality: 1
  on class: Identifier
description: A Format can be defined as a collection of audio / video / data and container Formats. A Format can be globally associated with a MediaResource but Specific audio / video / data and container Formats can also be distinctly associated with a MediaResource. The ContainerFormat defines the file / package structure of the MediaResource.