Audit Report
type: Class
subclass of: Restriction
  on property: hasApprover
  all values from: Agent
subclass of: Restriction
  on property: hasAuditReportDate
  all values from: Instant
subclass of: Restriction
  on property: hasIdentifier
  all values from: Identifier
subclass of: Restriction
  on property: hasObjectType
  all values from: Concept
subclass of: Restriction
  on property: hasRelatedAuditJob
  all values from: AuditJob
subclass of: Restriction
  on property: hasRelatedResource
  all values from: Resource
subclass of: Restriction
  on property: referencesRule
  all values from: Rule
subclass of: Restriction
  on property: auditReportResults
  all values from: Literal
subclass of: Restriction
  on property: description
  all values from: Literal
subclass of: Restriction
  on property: name
  all values from: Literal
description: An AuditReport aggregates results from related AuditJob.
definition: a report on aggregated results from auditing