Audit Job
type: Class
subclass of: ProductionJob
subclass of: Restriction
  on property: hasAuditJobRelatedAuditReport
  all values from: AuditReport
subclass of: Restriction
  on property: usesMeasure
  all values from: Measure
description: The assessment of compliance is made against a Measure associated with a Rule via an AuditJob.
definition: assessment of compliance against a Measure
example: - measuring the maximum volume level in the audio track of a video file - measuring the share of speaker time in a debate of the candidates before an election - measuring the share of male/females experts across all programmes of a publication service