Audience
type: Class
subclass of: Restriction
  on property: excludesAudience
  all values from: Audience
subclass of: Restriction
  on property: hasIdentifier
  all values from: Identifier
subclass of: Restriction
  on property: hasObjectType
  all values from: Concept
subclass of: Restriction
  on property: includesAudience
  all values from: Audience
subclass of: Restriction
  on property: audienceAgeHigh
  all values from: integer
subclass of: Restriction
  on property: audienceAgeLow
  all values from: integer
subclass of: Restriction
  on property: audienceCount
  all values from: Literal
subclass of: Restriction
  on property: audienceInterest
  all values from: Literal
subclass of: Restriction
  on property: description
  all values from: Literal
subclass of: Restriction
  on property: name
  all values from: Literal
description: A group of Consumers or an aggregation of groups of Consumers clustered e.g. by class of age , social categories or else.
definition: a segment of the potential consumers of media services distinguished by criteria that shape their consumption behaviour, like age, education, sex, social status, residence, attitudes, etc
example: - age 14 to 29 - rural youth - males over 70 - culture oriented people - fun oriented people - school kid's parents - low educated males under 25 - young progressive people