Asset
type: Class
subclass of: Restriction
  on property: derivedTo
  all values from: Asset
subclass of: Restriction
  on property: hasAccessConditions
  all values from: AccessConditions
subclass of: Restriction
  on property: hasAssetValue
  all values from: AssetValue
subclass of: Restriction
  on property: hasChild
  all values from: Asset
subclass of: Restriction
  on property: hasContact
  all values from: Contact
subclass of: Restriction
  on property: hasCopyright
  all values from: Copyright
subclass of: Restriction
  on property: hasCoverageRestrictions
  all values from: CoverageRestrictions
subclass of: Restriction
  on property: hasCreativeCommons
  all values from: CreativeCommons
subclass of: Restriction
  on property: hasDisclaimer
  all values from: Disclaimer
subclass of: Restriction
  on property: hasExploitationIssues
  all values from: ExploitationIssues
subclass of: Restriction
  on property: hasIPRRestrictions
  all values from: IPRRestrictions
subclass of: Restriction
  on property: hasIdentifier
  all values from: Identifier
subclass of: Restriction
  on property: hasLicensing
  all values from: Licensing
subclass of: Restriction
  on property: hasParticipatingAgent
  all values from: Agent
subclass of: Restriction
  on property: hasRelatedArtefact
  all values from: Artefact
subclass of: Restriction
  on property: hasRelatedAsset
  all values from: Asset
subclass of: Restriction
  on property: hasRelatedAuditReport
  all values from: AuditReport
subclass of: Restriction
  on property: hasRelatedEditorialObject
  all values from: EditorialObject
subclass of: Restriction
  on property: hasRelatedPicture
  all values from: Picture
subclass of: Restriction
  on property: hasRelatedRecord
  all values from: Record
subclass of: Restriction
  on property: hasRelatedResource
  all values from: Resource
subclass of: Restriction
  on property: hasRights
  all values from: Rights
subclass of: Restriction
  on property: hasRightsClearance
  all values from: RightsClearance
subclass of: Restriction
  on property: hasUsageRestrictions
  all values from: UsageRestrictions
subclass of: Restriction
  on property: hasUsageRights
  all values from: UsageRights
subclass of: Restriction
  on property: isDerivedFrom
  all values from: Asset
subclass of: Restriction
  on property: isReplacedBy
  all values from: Asset
subclass of: Restriction
  on property: replaces
  all values from: Asset
subclass of: Restriction
  on property: hasDateArchived
  max qualified cardinality: 1
  on class: Instant
subclass of: Restriction
  on property: hasDateCreated
  max qualified cardinality: 1
  on class: Instant
subclass of: Restriction
  on property: hasDateDeleted
  max qualified cardinality: 1
  on class: Instant
subclass of: Restriction
  on property: hasDateDistributed
  max qualified cardinality: 1
  on class: Instant
subclass of: Restriction
  on property: hasDateLicenseEnd
  max qualified cardinality: 1
  on class: Instant
subclass of: Restriction
  on property: hasDateLicensedStart
  max qualified cardinality: 1
  on class: Instant
subclass of: Restriction
  on property: hasDateModified
  max qualified cardinality: 1
  on class: Instant
subclass of: Restriction
  on property: hasDateProduced
  max qualified cardinality: 1
  on class: Instant
subclass of: Restriction
  on property: hasDateReleased
  max qualified cardinality: 1
  on class: Instant
subclass of: Restriction
  on property: hasObjectType
  max qualified cardinality: 1
  on class: Concept
subclass of: Restriction
  on property: isChildOf
  max qualified cardinality: 1
  on class: Asset
subclass of: Restriction
  on property: description
  all values from: Literal
subclass of: Restriction
  on property: name
  all values from: Literal
subclass of: Restriction
  on property: orderedFlag
  max qualified cardinality: 1
  on data range: boolean
disjoint with: Rating
description: Assets are EditorialObjects or Resources with associated Rights. An «Asset» is an object to which an identifier will be associated at commissioning time. It serves as a central reference point to manage rights associated with EditorialObjects, MediaResources or Essences, and - by inference - PublicationEvents (distribution and exploitation conditions). Remember that the MediaResources or Essences will in this model always be represented by an EditorialObject. Example: The CCDM model allows the association of Rights to a related EditorialObject that is represented by one or more Essences.
definition: a media object that is intended for publication and consumption, attributed with author's rights and copyrights, and representing value.
example: - a film on tape in the archive - a digital audio recording with associated author's right and copyright - a book - a collection of books