Account
type: Class
subclass of: Restriction
  on property: hasConsumptionContract
  all values from: Contract
subclass of: Restriction
  on property: hasIdentifier
  all values from: Identifier
subclass of: Restriction
  on property: hasObjectType
  all values from: Concept
subclass of: Restriction
  on property: hasRelatedAccount
  all values from: Account
subclass of: Restriction
  on property: holdsLicence
  all values from: ConsumptionLicence
subclass of: Restriction
  on property: description
  all values from: Literal
subclass of: Restriction
  on property: name
  all values from: Literal
description: A registration Account to a Service. Account information can vary from one Service to another. Such information covers e.g. a (nick)name, a login, an age, sex, domains of interest or more.
definition: a registration identity for a media service
example: - a registered user to access netflix - a registered family with nicknames and devices to access a VOD service